test_maximum_valid_long_identifier_dataset_can_verify_its_own_result (test_engine.EngineTests.test_maximum_valid_long_identifier_dataset_can_verify_its_own_result) ... FAIL

======================================================================
FAIL: test_maximum_valid_long_identifier_dataset_can_verify_its_own_result (test_engine.EngineTests.test_maximum_valid_long_identifier_dataset_can_verify_its_own_result)
----------------------------------------------------------------------
Traceback (most recent call last):
  File "<project>\tests\test_engine.py", line 236, in test_maximum_valid_long_identifier_dataset_can_verify_its_own_result
    self.assertTrue(response["ok"], response)
AssertionError: False is not true : {'artifacts': {}, 'error': {'code': 'INPUT_LIMIT', 'message': 'A file exceeds the one MiB input limit.', 'retryable': False}, 'ok': False, 'protocol_version': '1.0', 'request_id': 'verify-large', 'result': None, 'status': 'error', 'tool': 'verify_result', 'verification': {'host_cancellation': 'not_tested', 'human_review': 'not_performed', 'native_bi': 'not_run', 'os_sandbox': 'not_claimed', 'real_model_quality': 'not_tested'}}

----------------------------------------------------------------------
Ran 1 test in 0.996s

FAILED (failures=1)
